{"text_format":"1","workbook":"xlsx","n_sheets":4,"sheets":["Hoja1","RECIBO","Hoja3","Hoja2"],"not_rendered":{"charts":0,"images":0,"macros":1,"external_links":0,"defined_names":2,"comments":0,"pivot_tables":0},"unopened":[],"bounds":{"document_bytes":16777216,"sheet_cells":100000,"rows_first":2000,"rows_last":500,"rows_between":2000,"halvings":0,"cell_chars":16384,"cell_head_chars":4096},"cells_cut":0,"cells_raw":0,"read":"whole","date_system":"1900"}

{"sheet":"Hoja1","index":0,"n_rows":418,"n_cols":3,"rows_kept":418,"cut":false,"hidden":false,"merged":[[399,0,399,2],[400,0,400,2],[401,0,401,2],[402,0,402,2],[287,0,287,2],[288,0,288,2],[342,0,342,2],[343,0,343,2],[344,0,344,2],[345,0,345,2],[228,0,228,2],[229,0,229,2],[230,0,230,2],[231,0,231,2],[285,0,285,2],[286,0,286,2],[116,0,116,2],[117,0,117,2],[171,0,171,2],[172,0,172,2],[173,0,173,2],[174,0,174,2],[59,0,59,2],[60,0,60,2],[57,0,57,2],[58,0,58,2],[114,0,114,2],[115,0,115,2],[0,0,0,2],[1,0,1,2],[2,0,2,2],[3,0,3,2]]}
["PAGO DE CUADRO DE HONOR CORRESPONDIENTE AL CICLO ESCOLAR 20192020P"]
["HORARIO DE PAGO"]
["DE 10:00 A 10:20 HRS."]
["LUGAR DE PAGO: CENTRO DE INFORMACIÓN"]
[]
["No.","MATRICULA","BENEFICIARIO"]
[1,4058,"VICTOR ISAI KU CHI"]
[2,4059,"DIEGO RENE HAAS WICAB"]
[3,4060,"ADRIANA CONCEPCIÓN MOO GARCIA"]
[4,4061,"CARLOS ANGEL COHUO HUCHIN"]
[5,4062,"ROSA DEL CARMEN CANUL MAAS"]
[6,4063,"JENRY SAMUEL EK CHABLE"]
[7,4064,"LUIS IGNACIO AKE CAHUM"]
[8,4065,"ROBERTO ANGEL DZIB CHI"]
[9,4066,"JOSE IGNACIO YAH BALAM"]
[10,4067,"LUIS ASUNCION CHI MOO"]
[11,4068,"BRIANI DEL CARMEN PECH ZAMARRIPA"]
[12,4069,"CRISTINA ASUNCION CHUC CHE"]
[13,4070,"LAURA BEATRIZ MISS CAUICH"]
[14,4071,"YURI ABIGAIL BALAN CRUZ"]
[15,4072,"SERGIO EDUARDO TUN PAREDES"]
[16,4073,"KARIME DEL PILAR HUCHIN UC"]
[17,4074,"LEYSLY DEL JESUS MAY CHI"]
[18,4075,"JOSE ROBERTO CHI EK"]
[19,4076,"ANDRES RAFAEL TUZ CAN"]
[20,4077,"ADRIAN EDUARDO PAN CHI"]
[21,4078,"GERSON MANUEL ESTRELLA TREJO"]
[22,4079,"AMBAR GUADALUPE DEL JESUS MARTIN BARBOSA"]
[23,4080,"GUIMAR JAVIER AVILES BRICEÑO"]
[24,4081,"PABLO REY LOPEZ CAUICH"]
[25,4082,"VICTOR ALFONSO CHAN PECH"]
[26,4083,"VIOLETA JANET UC NAAL"]
[27,4084,"LITZY ODETH YAN CANUL"]
[28,4085,"JAFET MANUEL YAN CAAMAL"]
[29,4086,"LIZBET BEATRIZ YAN CHI"]
[30,4087,"AYLIN GUADALUPE KU MUÑOZ"]
[31,4088,"LESLIE KARYME TUN CHAN"]
[32,4089,"EDGAR DANIEL CHABLE MAY"]
[33,4090,"ANA MARIA HAAS CHABLE"]
[34,4091,"KEYLA MAGALY TAMAY CHUC"]
[35,4092,"DANIELA DE JESUS CANCHE DZIB"]
[36,4093,"KARINA ROXANA AKE AKE"]
[37,4094,"JAIME ALEJANDRO COLLI CAAMAL"]
[38,4095,"SAN FRANCISCO JAVIER NAAL AC"]
[39,4096,"MARIA GUADALUPE CAN CAHUICH"]
[40,4097,"JOSE ALEJANDRO REYNA BALAN"]
[41,4098,"NEIMI ANDREA ESTRELLA CASANOVA"]
[42,4099,"WILSON RAUL NAAL NAAL"]
[43,4100,"CESAR IVAN CARRILLO MAY"]
[44,4101,"OSIRIS DEL CRISTEL NAAL AYIL"]
[45,4102,"ARTURO KOYOC HUCHIN"]
[46,4103,"BERTHA YURITZI COLLI GALLARETA"]
[47,4104,"PEDRO FRANCISCO DE LA CRUZ CERVANTES IC"]
[48,4105,"URIEL ABSALON COLLI PUC"]
[49,4106,"JESUS ISAEL TEC CANUL"]
[50,4107,"EDUARDO ISMAEL EUAN CHAN"]
[]
["PAGO DE CUADRO DE HONOR CORRESPONDIENTE AL CICLO ESCOLAR 20192020P"]
["HORARIO DE PAGO"]
["DE 10:30 A 10:50 HRS."]
["LUGAR DE PAGO: CENTRO DE INFORMACIÓN"]
[]
["No.","MATRICULA","BENEFICIARIO"]
[51,4108,"MARIANA ESTHER CAAMAL PUC"]
[52,4109,"WENDY ILEANA CAUICH MIS"]
[53,4110,"MARIO ANTONIO POOT MAY"]
[54,4111,"PAOLA GUADALUPE GONZALEZ ULLOA"]
[55,4112,"SARID LUCERO DE LAS MERCEDES EUAN ALCOCER"]
[56,4113,"KEVIN EMMANUEL GOMEZ SANSORES"]
[57,4114,"GADDI JAHAZIEL CENTENO CELIS"]
[58,4115,"JULIO CESAR EK CHIM"]
[59,4116,"MARIA MARGARITA CONTRERAS PUC"]
[60,4117,"ULISES NOE CAAMAL POOT"]
[61,4118,"CRISTIAN DEL JESUS CHI UC"]
[62,4119,"MIRIAM DEL CARMEN CHAN CHI"]
[63,4120,"FABIOLA GUADALUPE CAHUICH CHAN"]
[64,4121,"STEPHANY KAROLYNA AYALA RAMIREZ"]
[65,4122,"MERARI CORAZON DE LA CRUZ DZIB"]
[66,4123,"SONIA LILIANA BRITO CAAMAL"]
[67,4124,"ALEJANDRA AURORA ORDOÑEZ MORENO"]
[68,4125,"FATIMA DEL ROSARIO COB LOPEZ"]
[69,4126,"JUANA LISSET CHAN NAAL"]
[70,4127,"ADAMARIS ESTEFANY CAAMAL UC"]
[71,4128,"MIGUEL ANGEL CAUICH CAMAS"]
[72,4129,"LANDY DEL CARMEN HUCHIN CAUICH"]
[73,4130,"LIANY GUADALUPE CAN CAHUM"]
[74,4131,"ALMA NICTE-HA BE GOMEZ"]
[75,4132,"JOSUE MOISES CHI COHUO"]
[76,4133,"FENIX DE ATOCHA NOH COLLI"]
[77,4134,"ABRAHAM BALAM BEBERAJE"]
[78,4135,"KARIME MELISA XIU ORTIZ"]
[79,4136,"DAYLA BERENICE NAH CAN"]
[80,4137,"JUAN EDUARDO RAMIREZ OLETA"]
[81,4138,"IRVING SANTIAGO PECH DZIB"]
[82,4139,"SANDY DZIB TAMAY"]
[83,4140,"ANAHI DEL CARMEN CAB RIOS"]
[84,4141,"LIZBETH BEATRIZ HAAS CHABLE"]
[85,4142,"YADY CARMINI GONZALEZ CHI"]
[86,4143,"CAROLINA COLLI CAUICH"]
[87,4144,"REYNA ISABEL MAAS CAAMAL"]
[88,4145,"FRANCISCO GEOVANNY MARTIN CANCHE"]
[89,4146,"ANGELICA GUADALUPE UC SANCHEZ"]
[90,4147,"BLANCA ESTELA DZIB PANTI"]
[91,4148,"NOELIA ARLETTH CHIM CAN"]
[92,4149,"YANELY ISABEL TUZ KEB"]
[93,4150,"NAYELI DEL ROCIO EUAN CHI"]
[94,4151,"JOSE LUIS NAAL FUENTES"]
[95,4152,"MARTHA LETICIA CHAN SANCHEZ"]
[96,4153,"NIDIA IREYNA DZIB CHIN"]
[97,4154,"JOSE RICARDO TAMAY YAH"]
[98,4155,"ANGEL GUADALUPE EK UICAB"]
[99,4156,"INGRID DEL ROSARIO ECHEZARRETA KANTUN"]
[100,4157,"DARWIN ENRRIQUE UC COLLI"]
[]
["PAGO DE CUADRO DE HONOR CORRESPONDIENTE AL CICLO ESCOLAR 20192020P"]
["HORARIO DE PAGO"]
["DE 11:00 A 11:20 HRS."]
["LUGAR DE PAGO: CENTRO DE INFORMACIÓN"]
[]
["No.","MATRICULA","BENEFICIARIO"]
[101,4158,"ROLANDO IVAN CAUICH CANCHE"]
[102,4159,"ANA GABRIELA TZEC KANTUN"]
[103,4160,"GRECIA JAREILA EK CHIM"]
[104,4161,"ANGEL JULIAN OCHOA AC"]
[105,4162,"YARELI DEL CARMEN TAMAY CAHUICH"]
[106,4163,"ANGELA YUDEIMIS VARGAS ZAVALA"]
[107,4164,"MARIA SANTAELENA HAAS BACAB"]
[108,4165,"VIVIANA DE JESUS CEH EUAN"]
[109,4166,"JESUS ERNESTO UC UCAN"]
[110,4167,"YANELI GUADALUPE YAH TUZ"]
[111,4168,"FLOR GUADALUPE CANCHE CRUZ"]
[112,4169,"OSCAR GUTIERREZ BATUN"]
[113,4170,"ANDREA CAROLINA NEGRON DIAZ"]
[114,4171,"SUEMY AMAYRAMI DZIB PECH"]
[115,4172,"FREDDY GERARDO CHI MARTINEZ"]
[116,4173,"MARIA DE LOS ANGELES DZUL POOT"]
[117,4174,"FERNANDO ANTONIO ORTIZ CHI"]
[118,4175,"ANDREA GUADALUPE CHI RIOS"]
[119,4176,"EMANUEL ESTEBAN FARFAN BRICEÑO"]
[120,4177,"MARIA ISABEL PECH KU"]
[121,4178,"ISMAEL ALEXANDER MAAS MARTINEZ"]
[122,4179,"EMILI DEL ROCIO CHAN CHIN"]
[123,4180,"ALEXIS JOAN UC PECH"]
[124,4181,"FELIPE POOT DZIB"]
[125,4182,"LAISA SARAI CHI CHUC"]
[126,4183,"JOSE EFRAIN CHABLE CAMARA"]
[127,4184,"MARIA DE JESUS CAAMAL COL"]
[128,4185,"ERICK ALEJANDRO MAY AKE"]
[129,4186,"MARIA DEL CARMEN DZIB CUY"]
[130,4187,"FANY MARLENE COLLI CAN"]
[131,4188,"SANDY DEL SOCORRO HUCHIN COLLI"]
[132,4189,"INES DEL ROSARIO HAAS NAAL"]
[133,4190,"OCTAVIO ASUNCION HUCHIN XOOL"]
[134,4191,"MARCOS ANTONIO CHAN PUC"]
[135,4192,"ZUEMY YANNET CAAMAL TZAB"]
[136,4193,"MANUEL ALEJANDRO CAAMAL CHUC"]
[137,4194,"FRANCISCO DANIEL HUCHIN BALAN"]
[138,4195,"ROGEL ARMANDO NAH CAAMAL"]
[139,4196,"DIANA DEL SOCORRO EK PUC"]
[140,4197,"JULIO CESAR MIS CAUICH"]
[141,4198,"ROSA ANGELICA MENDEZ ASENCIO"]
[142,4199,"FANNY ARELY UICAB CHUC"]
[143,4200,"CAROL CELESTE MOO CHAN"]
[144,4201,"ERICK QUIME RIOS"]
[145,4202,"DORCAS ARELLY UC CENTENO"]
[146,4203,"NICK HENDRYCKSON KOYOC XEQUEB"]
[147,4204,"JORGE ARMANDO PEREZ CAMACHO"]
[148,4205,"DANIEL BERNARDINO TORRES CAB"]
[149,4206,"LUIS GUSTAVO PECH CHI"]
[150,4207,"VIRGINIA COLLI UC"]
[]
["PAGO DE CUADRO DE HONOR CORRESPONDIENTE AL CICLO ESCOLAR 20192020P"]
["HORARIO DE PAGO"]
["DE 11:30 A 11:50 HRS."]
["LUGAR DE PAGO: CENTRO DE INFORMACIÓN"]
[]
["No.","MATRICULA","BENEFICIARIO"]
[151,4208,"RODOLFO ENRIQUE DZIB CHABLE"]
[152,4209,"ALEX IVAN CHABLE CAN"]
[153,4210,"FRANCISCO DAVID FLORES CAHUICH"]
[154,4211,"JESUS MARTIN KANTUN VENTURA"]
[155,4212,"PEDRO PABLO PECH PECH"]
[156,4213,"ERIK ENRIQUE TZEC YAH"]
[157,4214,"SARYANI ANGELES COL PECH"]
[158,4215,"JORGE ISRAEL POOT CAUICH"]
[159,4216,"JULISSA ISABEL GOMEZ POOT"]
[160,4217,"JOSE ALBERTO CHI QUEJ"]
[161,4218,"ROSA ISELA EK CHAN"]
[162,4219,"LIZZETH ABRIL NAAL MAY"]
[163,4220,"JORGE ISAIAS AKE CHE"]
[164,4221,"LIZETH DEL RUBI POOT PECH"]
[165,4222,"BERENICE LLUVILET POOL NAAL"]
[166,4223,"EDWARD ALEJANDRO PEREZ HERNANDEZ"]
[167,4224,"RICARDO ISMAEL DZACUN ESTRELLA"]
[168,4225,"SELINA LEONOR CHE"]
[169,4226,"ORLANDO ABRHAN COLLI GOMEZ"]
[170,4227,"FATIMA DENNISE KEB ORTIZ"]
[171,4228,"JHOVANNY HACIL CHI BACAB"]
[172,4229,"CRISTINA GUADALUPE GONZALEZ EK"]
[173,4230,"DANIEL ALBERTO CAUICH CHAN"]
[174,4231,"HUMBERTO ESTEBAN ROSADO CUPUL"]
[175,4232,"SOFIA VICTORIA CHIM CANCHE"]
[176,4233,"JUAN PABLO DORANTES SANCHEZ"]
[177,4234,"JESUS ALBERTO PAT MOO"]
[178,4235,"JOSE FERNANDO MAY ALCOCER"]
[179,4236,"JUAN ALBERTO AYALA CHAN"]
[180,4237,"JUAN CARLOS ORDOÑEZ PUGA"]
[181,4238,"FELIX FILIBERTO ISAI TUZ CANUL"]
[182,4239,"ERIK RENAN PECH MAY"]
[183,4240,"ANDY FERRERA JUAREZ"]
[184,4241,"LUIS FERNANDO CAN DZIB"]
[185,4242,"KARLA PATRICIA UHU COLLI"]
[186,4243,"NIDIA SAIDEY CUA CALDERON"]
[187,4244,"SERGIO SANTOS CALDERON"]
[188,4245,"DANIEL ALEJANDRO KEB KU"]
[189,4246,"ARIANA BEATRIZ KANTUN MAY"]
[190,4247,"VICTOR MANUEL COOL CHABLE"]
[191,4248,"NELY MAY MIS"]
[192,4249,"ANTONIO AZAEL CANCHE ORTIZ"]
[193,4250,"ANGEL ZAHID JUAREZ CANUL"]
[194,4251,"ERICK ARIEL UCAN ESPAÑA"]
[195,4252,"MANUEL TEC CHI"]
[196,4253,"LUIS DANIEL MAY CAUICH"]
[197,4254,"JULIO CESAR TUCUCH UH"]
[198,4255,"ROBERTO ANGEL TUN ORTIZ"]
[199,4256,"MARIA ELIZABETH SANCHEZ BALAM"]
[200,4257,"CYNTHIA YAZMIN CABRERA CABRERA"]
[]
["PAGO DE CUADRO DE HONOR CORRESPONDIENTE AL CICLO ESCOLAR 20192020P"]
["HORARIO DE PAGO"]
["DE 12:00 A 12:20 HRS."]
["LUGAR DE PAGO: CENTRO DE INFORMACIÓN"]
[]
["No.","MATRICULA","BENEFICIARIO"]
[201,4258,"ALEX FRANCISCO CHIN TZAB"]
[202,4259,"JOSE PAULINO BACAB DZIB"]
[203,4260,"EZIQUIEL TUN CHI"]
[204,4261,"ANGEL TIMOTEO PECH MAY"]
[205,4262,"MARIA DEL CARMEN MUKUL KANTUN"]
[206,4263,"LURDES ARACELY DZUL EUAN"]
[207,4264,"ABEL ALFREDO SIMA CHI"]
[208,4265,"JOEL ISIDRO SANCHEZ UC"]
[209,4266,"ALMA YANELY TZUC CAUICH"]
[210,4267,"PERLA GERTRUDIS CHAN CAHUICH"]
[211,4268,"MONICA ISEL CANUL AKE"]
[212,4269,"MOISES ABRAHAM DZUL GARRIDO"]
[213,4270,"PAOLA MIXEL UCAN CANUL"]
[214,4271,"FELIX DANIEL LLANES AGUILAR"]
[215,4272,"ANGEL ISRAEL TZUC RUIZ"]
[216,4273,"IRVING LEONARDO UC UC"]
[217,4274,"GELMY GABRIELA PISTE CAUICH"]
[218,4275,"SILVERIO HAAS HUCHIN"]
[219,4276,"JOSE ALFREDO DZUL HAU"]
[220,4277,"DAYRA ALEXANDRA CANCHE TUN"]
[221,4278,"YARELI MARICRUZ SIMA MAY"]
[222,4279,"FREDY JAVIER MORALES RIVERA"]
[223,4280,"ALEXIS JOSE RIVERA GOMEZ"]
[224,4281,"EDREI ANTONIO AKE MAY"]
[225,4282,"JESUS ISRAEL EK BALAN"]
[226,4283,"ABRAHAM FARID MELKEN TAMAY"]
[227,4284,"JULIA JENNIFER COOX AKE"]
[228,4285,"YAZULY ABIGAIL POOL CAUICH"]
[229,4286,"SERGIO EDUARDO AKE AKE"]
[230,4287,"NAYELI MAYRANI PECH TUN"]
[231,4288,"MARIO RAMIRO DZUL DZUL"]
[232,4289,"YAHAIRA NICTE-HAA MEDINA TRUJEQUE"]
[233,4290,"MIGUEL ALEJANDRO CAN CHI"]
[234,4291,"GABRIELA LIZETH GONZALEZ HUCHIN"]
[235,4292,"MARIA CATALINA DE LA PAZ CERVERA NOH"]
[236,4293,"JOSE DEL CARMEN PECH CHI"]
[237,4294,"CARLOS RAFAEL HERNANDEZ FARFAN"]
[238,4295,"CRYSTEL FABIOLA KUK EUAN"]
[239,4296,"JOSE CANDELARIO CHAN TUN"]
[240,4297,"JUAN DANIEL CORDOVA CHAN"]
[241,4298,"JULIAN CORZO CHE"]
[242,4299,"RANDALL COHUO CHI"]
[243,4300,"JOSE GILBERTO PECH CAUICH"]
[244,4301,"JESUS ALEJANDRO CHIM CAHUICH"]
[245,4302,"ALEXIS ANTONIO CHI CORTEZ"]
[246,4303,"GERARDO ALDAIR CHAN PAT"]
[247,4304,"CARLOS DANIEL CAAMAL MOO"]
[248,4305,"MIGUEL ÁNGEL GERONIMO CHABLE"]
[249,4306,"ERIK ALEJANDRO ARANA HERRERA"]
[250,4307,"CESAR FERNANDO CABRERA KU"]
[]
["PAGO DE CUADRO DE HONOR CORRESPONDIENTE AL CICLO ESCOLAR 20192020P"]
["HORARIO DE PAGO"]
["DE 12:30 A 12:50 HRS."]
["LUGAR DE PAGO: CENTRO DE INFORMACIÓN"]
[]
["No.","MATRICULA","BENEFICIARIO"]
[251,4308,"LUIS FERNANDO HUCHIN AC"]
[252,4309,"JOSE YAIR CHUC ZAPATA"]
[253,4310,"DANIEL ADRIAN NEGRON KU"]
[254,4311,"FRANCISCO JAVIER DOMINGUEZ OVALLE"]
[255,4312,"ANGEL GABRIEL CHAN PECH"]
[256,4313,"CARLOS DAVID XEQUEB KOYOC"]
[257,4314,"RICARDO DANIEL CHAN MOO"]
[258,4315,"FRANCISCO ISMAEL COYOC CASTILLO"]
[259,4316,"CARLOS ANTONIO POOT TAMAY"]
[260,4317,"CARLOS SANTIAGO COLLI AGUAYO"]
[261,4318,"ESTEBAN EMMANUEL CAAMAL CANUL"]
[262,4319,"LEONARDO DAVID MIS PISTE"]
[263,4320,"ADOLFO ANGEL SALAZAR CAUICH"]
[264,4321,"FATIMA ABIGAIL CHABLE TZAB"]
[265,4322,"ADOLFO ANGEL MIS CHAN"]
[266,4323,"WILSON AZAEL CAN MUT"]
[267,4324,"MIGUEL ANGEL MADERO RODRIGUEZ"]
[268,4325,"JUAN ALBERTO MORENO BORGES"]
[269,4326,"LUIS EDUARDO SANCHEZ CABALLERO"]
[270,4327,"GEOVANNI SANTANDER MOO CHIN"]
[271,4328,"LUIS GERARDO GONZALEZ PEDRERO"]
[272,4329,"NISI ISRAEL CALDERON PINO"]
[273,4330,"JONATHAN ALEXANDER SUAREZ GONZALEZ"]
[274,4331,"MARCOS ANDRES BELTRUY NAVA"]
[275,4332,"ANGEL SANTIAGO PERALTA SALINAS"]
[276,4333,"DENNIS EUDREY DZIB REYES"]
[277,4334,"RIGEL DIDIER LOPEZ WONG"]
[278,4335,"ALDAIR DE JESUS PADILLA GONGORA"]
[279,4336,"FELIPE DE JESUS BALAN MARTIN"]
[280,4337,"GERARDO DANIEL CHI CANUL"]
[281,4338,"BRAYAN ISRAEL CHI ESCAMILLA"]
[282,4339,"KLEYVER ALEXIS CHIM CHAY"]
[283,4340,"BRYAN ALEJANDRO NOH HERNANDEZ"]
[284,4341,"RUSSEL ARIEL UC PUC"]
[285,4342,"GHARY HEMYR TUN ORTIZ"]
[286,4343,"MIGUEL ANTONIO ORDÓÑEZ CÁMARA"]
[287,4344,"LUIS GERARDO COLLI MIJANGOS"]
[288,4345,"RODRIGO VIDAL CAAMAL ARANDA"]
[289,4346,"JONATHAN EMMANUEL MENDEZ CHI"]
[290,4347,"SANDRA MARVELI TAMAY DZUL"]
[291,4348,"JORDAN JOAN CAHUICH CHAN"]
[292,4349,"ILIANA CRISTINA CHABLE MAY"]
[293,4350,"CARLOS ENRIQUE YAM CAAMAL"]
[294,4351,"JAYRO JESUS KU SALAZAR"]
[295,4352,"ANGEL EDUARDO MOLINA CHI"]
[296,4353,"EDWIN MANUEL UC BALAM"]
[297,4354,"DANIEL DE JESUS PERERA DZUL"]
[298,4355,"LOURDEZ LIZEET ARREDONDO MUT"]
[299,4356,"GLENDY MERARI YAH CANUL"]
[300,4357,"YANELY SUGEY CHI POOT"]
[]
["PAGO DE CUADRO DE HONOR CORRESPONDIENTE AL CICLO ESCOLAR 20192020P"]
["HORARIO DE PAGO"]
["DE 13:00 A 13:20 HRS."]
["LUGAR DE PAGO: CENTRO DE INFORMACIÓN"]
[]
["No.","MATRICULA","BENEFICIARIO"]
[301,4358,"ROGER ENRIQUE HUCHIM CHI"]
[302,4359,"DARWIN DANILO TAMAY CANUL"]
[303,4360,"SHADITH ABIGAIL PAAT CENTENO"]
[304,4361,"JUAN CARLOS HERRERA NOVELO"]
[305,4362,"LARISSA IVETH CHI KOH"]
[306,4363,"LUIS ENRIQUE BACAB EUAN"]
[307,4364,"GLADIOLA DE JESUS MAY MIS"]
[308,4365,"GUADALUPE LUCILA PALMER CEH"]
[309,4366,"DIDIER ABISAI TZEC UICAB"]
[310,4367,"XIMENA GUADALUPE KU DZUL"]
[311,4368,"YULENI VIVIANA PUC CABRERA"]
[312,4369,"ANDREA LIZETH TZUC HERRERA"]
[313,4370,"MARIA ARACELI MAAS AKE"]
[314,4371,"BENJAMIN ALEXANDER AKE TUN"]
[315,4372,"RUSSELL ARMIN CENTENO CETINA"]
[316,4373,"EDUARDO DANIEL UC KUK"]
[317,4374,"MARIA LETICIA CHUC CAUICH"]
[318,4375,"MARIA JOSE KU ROBALDINO"]
[319,4376,"JUANITA ELIZABET EK PUC"]
[320,4377,"EDUARDO RENE NAH MIAN"]
[321,4378,"GUADALUPE DE LOS ANGELES PANTI POOT"]
[322,4379,"LUIS GUSTAVO BALAM CAAMAL"]
[323,4380,"ALEX IVAN CHAN ESTRELLA"]
[324,4381,"ANDRES DE LA CRUZ HUCHIN PANTI"]
[325,4382,"MOISES ABRAHAM PECH NAAL"]
[326,4383,"CANDELARIO KEB POOT"]
[327,4384,"GILBERTO DANIEL CHAN MAAS"]
[328,4385,"LUIS DAVID DZIB SIMA"]
[329,4386,"JAIR ALBERTO CHI POOL"]
[330,4387,"CARLOS DANIEL MOO POOT"]
[331,4388,"JOEL ADRIAN CANUL CAB"]
[332,4389,"JOSE LIZANDRO KU VAZQUEZ"]
[333,4390,"MARIA MAGDALENA MAAS CAAMAL"]
[334,4391,"EDWIN ISRAEL CHAN DZIB"]
[335,4392,"MARIA AMELIA CARRILLO TUN"]
[336,4393,"MARIA GRISELDA BEATRIZ YAH YAH"]
[337,4394,"ERNESTO EDUARDO KU UCAN"]
[338,4395,"MIRLEY DEYANEYRA NAAL MIAN"]
[339,4396,"DIANA LAURA COHUO HUCHIN"]
[340,4397,"OSMARA GUADALUPE CHAN CANO"]
[341,4398,"ESTEFANY EDITH TAMAY EUAN"]
[342,4399,"ANA ISABEL NAAL HUCHIN"]
[343,4400,"ANGELICA DEL ROSARIO CAN EK"]
[344,4401,"LUIS DAVID DE JESUS CASTILLA SUAREZ"]
[345,4402,"TERESA ALEJANDRA MORALES SORIANO"]
[346,4403,"RICARDO GONZALEZ VERDEJO"]
[347,4404,"DIANA YUSELI TAMAY DZUL"]
[348,4405,"ALFREDO MANUEL CALAN SIMA"]
[349,4406,"YOHANA MARIBEL POOL CAN"]
[350,4407,"REYNA MARIA CHI EK"]
[]
["PAGO DE CUADRO DE HONOR CORRESPONDIENTE AL CICLO ESCOLAR 20192020P"]
{"$rows_left_out":19}
{"sheet":"RECIBO","index":1,"n_rows":37,"n_cols":12,"rows_kept":37,"cut":false,"hidden":false,"merged":[[35,0,35,7],[14,1,14,3],[29,0,30,7],[16,0,17,7],[18,6,18,7],[19,0,19,7],[31,0,31,7],[6,3,7,4],[6,5,7,6],[11,5,11,7],[13,0,13,4],[33,0,33,7]]}
[4058,null,{"$f":"A36","v":"VICTOR ISAI KU CHI"}]
[]
[]
[]
[" "]
[]
[null,null,null,null,null,{"$f":"G26","v":{"$error":"#REF!"}},null,null,null,null,{"$f":"2100+600+700+1200+1700+700+600","v":7600}]
[]
[]
[]
[]
[null,null,null,"CALKINÍ,    CAMP.,     A  ",null,{"$f":"VLOOKUP(RECIBO!A1,Hoja1!B7:C968,6,FALSE)","v":{"$error":"#REF!"}},{"$f":"VLOOKUP(RECIBO!#REF!,Hoja1!#REF!,3,FALSE)","v":{"$error":"#REF!"}},{"$f":"VLOOKUP(RECIBO!#REF!,Hoja1!#REF!,3,FALSE)","v":{"$error":"#REF!"}}]
[]
[]
[]
[]
["RECIBI DEL INSTITUTO TECNOLOGICO SUPERIOR DE CALKINI EN EL ESTADO DE CAMPECHE, LA CANTIDAD DE:"]
[]
[null,null,null,null,null,null,{"$f":"G26","v":{"$error":"#REF!"}}]
[{"$f":"Hoja3!F12","v":{"$error":"#REF!"}}]
[]
[null,"IMPORTE DEL BIEN O SERVICIO",null,null,null,null,{"$f":"VLOOKUP(RECIBO!A1,Hoja1!B7:C968,3,FALSE)","v":{"$error":"#REF!"}}]
[null,"OTROS",null,null,null,null,{"$f":"VLOOKUP(RECIBO!A1,Hoja1!B7:C968,4,FALSE)","v":{"$error":"#REF!"}},null,null,null,135,{"$f":"600*13","v":7800}]
[null,"SUBTOTAL",null,null,null,null,{"$f":"G22+G23","v":{"$error":"#REF!"}}]
[null,"IMPUESTO RETENIDO",null,null,null,null,{"$f":"VLOOKUP(RECIBO!A1,Hoja1!B7:C968,5,FALSE)","v":{"$error":"#REF!"}},null,null,"=",null,"_=-="]
[null,"IMPORTE TOTAL",null,null,null,null,{"$f":"G24-G25","v":{"$error":"#REF!"}}]
[]
["POR CONCEPTO DE:"]
[]
[{"$f":"VLOOKUP(RECIBO!A1,Hoja1!B7:C968,7,FALSE)","v":{"$error":"#REF!"}}]
[]
[]
[]
["RECIBÍ"]
[]
[{"$f":"VLOOKUP(RECIBO!A1,Hoja1!B7:C968,2,FALSE)","v":"VICTOR ISAI KU CHI"}]
[null,null,null,"MATRICULA:",{"$f":"VLOOKUP(RECIBO!A1,Hoja1!B7:C968,8,FALSE)","v":{"$error":"#REF!"}}]

{"sheet":"Hoja3","index":2,"n_rows":102,"n_cols":8,"rows_kept":102,"cut":false,"hidden":false,"merged":[]}
[null,"UNIDADES","DECENAS","CENTENAS","MILES","C_MIL"]
[0," ",null,"CIEN"," "]
[{"$f":"A2+1","v":1},"UN",null,"CIENTO","UN",{"$f":"RECIBO!G26","v":{"$error":"#REF!"}},{"$f":"VALUE(RIGHT(ROUNDDOWN(F3,0),3))","v":{"$error":"#REF!"}},{"$f":"IF(G3<101,VLOOKUP(G3,$A$2:$E$102,5),CONCATENATE(VLOOKUP(VALUE(LEFT(G3,1)),$A$3:$D$11,4),\" \",VLOOKUP(VALUE(RIGHT(G3,2)),$A$2:$E$102,5)))","v":{"$error":"#REF!"}}]
[{"$f":"A3+1","v":2},"DOS ",null,"DOSCIENTOS","DOS ",null,{"$f":"VALUE(RIGHT(ROUNDDOWN($F$3/1000,0),3))","v":{"$error":"#REF!"}},{"$f":"IF(G4<101,VLOOKUP(G4,$A$2:$E$102,5),CONCATENATE(VLOOKUP(VALUE(LEFT(G4,1)),$A$3:$D$11,4),\" \",VLOOKUP(VALUE(RIGHT(G4,2)),$A$2:$E$102,5)))","v":{"$error":"#REF!"}}]
[3,"TRES ","TREINTA","TRESCIENTOS","TRES ",null,{"$f":"VALUE(RIGHT(ROUNDDOWN($F$3/1000000,0),3))","v":{"$error":"#REF!"}},{"$f":"IF(G5<101,VLOOKUP(G5,$A$2:$E$102,5),CONCATENATE(VLOOKUP(VALUE(LEFT(G5,1)),$A$3:$D$11,4),\" \",VLOOKUP(VALUE(RIGHT(G5,2)),$A$2:$E$102,5)))","v":{"$error":"#REF!"}}]
[4,"CUATRO ","CUARENTA","CUATROCIENTOS","CUATRO "]
[5,"CINCO ","CINCUENTA","QUINIENTOS","CINCO ","FINAL:",{"$f":"CONCATENATE(IF(H3=\" \",\"\",CONCATENATE(H3,)))","v":{"$error":"#REF!"}}]
[6,"SEIS  ","SESENTA","SEISCIENTOS","SEIS  ",null,{"$f":"CONCATENATE(IF(H4=\" \",\"\",CONCATENATE(H4,\" MIL \")))","v":{"$error":"#REF!"}}]
[7,"SIETE ","SETENTA","SETECIENTOS","SIETE ",null,{"$f":"CONCATENATE(IF(H5=\" \",\"\",IF(H5=\"UN\",CONCATENATE(H5,\" MILLON \"),CONCATENATE(H5,\" MILLONES \"))))","v":{"$error":"#REF!"}}]
[8,"OCHO ","OCHENTA","OCHOCIENTOS","OCHO ",null,{"$f":"RIGHT(ROUNDDOWN(F3*100,0),2)","v":{"$error":"#REF!"}}]
[9,"NUEVE ","NOVENTA","NOVECIENTOS","NUEVE ",{"$f":"IF(AND(G9=\"\",G8=\"\",G7=\"UN\"),CONCATENATE(G7,\" PESO \"),CONCATENATE(G9,G8,G7,\" PESOS \"))","v":{"$error":"#REF!"}}]
[10,"DIEZ","CIEN",null,"DIEZ",{"$f":"CONCATENATE(\"SON:(\",F11,\" \",G10,\"/100 M.N.)\")","v":{"$error":"#REF!"}}]
[11,"ONCE",null,null,"ONCE"]
[12,"DOCE",null,null,"DOCE"]
[13,"TRECE",null,null,"TRECE"]
[14,"CATORCE ",null,null,"CATORCE "]
[15,"QUINCE",null,null,"QUINCE"]
[16,"DIECISEIS",null,null,"DIECISEIS"]
[17,"DIECISIETE",null,null,"DIECISIETE"]
[18,"DIECIOCHO",null,null,"DIECIOCHO"]
[19,"DIECINUEVE",null,null,"DIECINUEVE"]
[20,"VEINTE",null,null,"VEINTE"]
[21,"VEINTIUNO",null,null,"VEINTIUN"]
[22,"VEINTIDOS",null,null,"VEINTIDOS"]
[23,"VEINTITRES",null,null,"VEINTITRES"]
[24,"VEINTICUATRO",null,null,"VEINTICUATRO"]
[25,"VEINTICINCO",null,null,"VEINTICINCO"]
[26,"VEINTISEIS",null,null,"VEINTISEIS"]
[27,"VEINTISIETE",null,null,"VEINTISIETE"]
[28,"VEINTIOCHO",null,null,"VEINTIOCHO"]
[29,"VEINTINUEVE",null,null,"VEINTINUEVE"]
[30,"TREINTA",null,null,"TREINTA"]
[{"$f":"A32+1","v":31},"TREINTA Y UNO",null,null,"TREINTA Y UN"]
[{"$f":"A33+1","v":32},"TREINTA Y DOS",null,null,"TREINTA Y DOS"]
[33,"TREINTA Y TRES",null,null,"TREINTA Y TRES"]
[34,"TREINTA Y CUATRO",null,null,"TREINTA Y CUATRO"]
[35,"TREINTA Y CINCO",null,null,"TREINTA Y CINCO"]
[36,"TREINTA Y SEIS",null,null,"TREINTA Y SEIS"]
[37,"TREINTA Y SIETE",null,null,"TREINTA Y SIETE"]
[38,"TREINTA Y OCHO ",null,null,"TREINTA Y OCHO "]
[39,"TREINTA Y NUEVE",null,null,"TREINTA Y NUEVE"]
[40,"CUARENTA",null,null,"CUARENTA"]
[41,"CUARENTA Y UNO",null,null,"CUARENTA Y UN"]
[42,"CUARENTA Y DOS",null,null,"CUARENTA Y DOS"]
[43,"CUARENTA Y TRES",null,null,"CUARENTA Y TRES"]
[44,"CUARENTA Y CUATRO",null,null,"CUARENTA Y CUATRO"]
[45,"CUARENTA Y CINCO",null,null,"CUARENTA Y CINCO"]
[46,"CUARENTA Y SEIS",null,null,"CUARENTA Y SEIS"]
[47,"CUARENTA Y SIETE",null,null,"CUARENTA Y SIETE"]
[48,"CUARENTA Y OCHO",null,null,"CUARENTA Y OCHO"]
[49,"CUARENTA Y NUEVE",null,null,"CUARENTA Y NUEVE"]
[50,"CINCUENTA ",null,null,"CINCUENTA "]
[51,"CINCUENTA Y UNO",null,null,"CINCUENTA Y UN"]
[52,"CINCUENTA Y DOS",null,null,"CINCUENTA Y DOS"]
[53,"CINCUENTA Y TRES",null,null,"CINCUENTA Y TRES"]
[54,"CINCUENTA Y CUATRO",null,null,"CINCUENTA Y CUATRO"]
[55,"CINCUENTA Y CINCO",null,null,"CINCUENTA Y CINCO"]
[56,"CINCUENTA Y SEIS",null,null,"CINCUENTA Y SEIS"]
[57,"CINCUENTA Y SIETE",null,null,"CINCUENTA Y SIETE"]
[58,"CINCUENTA Y OCHO",null,null,"CINCUENTA Y OCHO"]
[59,"CINCUENTA Y NUEVE",null,null,"CINCUENTA Y NUEVE"]
[60,"SESENTA ",null,null,"SESENTA "]
[61,"SESENTA Y UNO",null,null,"SESENTA Y UN"]
[62,"SESENTA Y DOS",null,null,"SESENTA Y DOS"]
[63,"SESENTA Y TRES",null,null,"SESENTA Y TRES"]
[64,"SESENTA Y CUATRO",null,null,"SESENTA Y CUATRO"]
[65,"SESENTA Y CINCO",null,null,"SESENTA Y CINCO"]
[66,"SESENTA Y SEIS",null,null,"SESENTA Y SEIS"]
[67,"SESENTA Y SIETE",null,null,"SESENTA Y SIETE"]
[68,"SESENTA Y OCHO",null,null,"SESENTA Y OCHO"]
[69,"SESENTA Y NUEVE",null,null,"SESENTA Y NUEVE"]
[70,"SETENTA",null,null,"SETENTA"]
[71,"SETENTA Y UNO",null,null,"SETENTA Y UN"]
[72,"SETENTA Y DOS",null,null,"SETENTA Y DOS"]
[73,"SETENTA Y TRES",null,null,"SETENTA Y TRES"]
[74,"SETENTA Y CUATRO",null,null,"SETENTA Y CUATRO"]
[75,"SETENTA Y CINCO",null,null,"SETENTA Y CINCO"]
[76,"SETENTA Y SEIS ",null,null,"SETENTA Y SEIS "]
[77,"SETENTA Y SIETE",null,null,"SETENTA Y SIETE"]
[78,"SETENTA Y OCHO",null,null,"SETENTA Y OCHO"]
[79,"SETENTA Y NUEVE",null,null,"SETENTA Y NUEVE"]
[80,"OCHENTA",null,null,"OCHENTA"]
[81,"OCHENTA Y UNO",null,null,"OCHENTA Y UN"]
[82,"OCHENTA Y DOS",null,null,"OCHENTA Y DOS"]
[83,"OCHENTA Y TRES",null,null,"OCHENTA Y TRES"]
[84,"OCHENTA Y CUATRO",null,null,"OCHENTA Y CUATRO"]
[85,"OCHENTA Y CINCO",null,null,"OCHENTA Y CINCO"]
[86,"OCHENTA Y SEIS ",null,null,"OCHENTA Y SEIS "]
[87,"OCHENTA Y SIETE",null,null,"OCHENTA Y SIETE"]
[88,"OCHENTA Y OCHO",null,null,"OCHENTA Y OCHO"]
[89,"OCHENTA Y NUEVE",null,null,"OCHENTA Y NUEVE"]
[90,"NOVENTA",null,null,"NOVENTA"]
[91,"NOVENTA Y UNO",null,null,"NOVENTA Y UN"]
[92,"NOVENTA Y DOS",null,null,"NOVENTA Y DOS"]
[93,"NOVENTA Y TRES",null,null,"NOVENTA Y TRES"]
[94,"NOVENTA Y CUATRO",null,null,"NOVENTA Y CUATRO"]
[95,"NOVENTA Y CINCO",null,null,"NOVENTA Y CINCO"]
[{"$f":"A97+1","v":96},"NOVENTA Y SEIS",null,null,"NOVENTA Y SEIS"]
[{"$f":"A98+1","v":97},"NOVENTA Y SIETE",null,null,"NOVENTA Y SIETE"]
[{"$f":"A99+1","v":98},"NOVENTA Y OCHO",null,null,"NOVENTA Y OCHO"]
[{"$f":"A100+1","v":99},"NOVENTA Y NUEVE",null,null,"NOVENTA Y NUEVE"]
[{"$f":"A101+1","v":100},"CIEN",null,null,"CIEN"]

{"sheet":"Hoja2","index":3,"n_rows":13,"n_cols":7,"rows_kept":13,"cut":false,"hidden":false,"merged":[[0,0,0,6],[1,0,1,6],[2,0,2,6],[4,0,5,0],[4,1,4,3],[4,4,4,5],[4,6,5,6]]}
["INSTITUTO TECNOLOÓGICO SUPERIOR DE CALKINI EN EL ESTADO DE CAMPECHE"]
["PAGO DE TRABAJOS ADICIONALES AL PERSONAL DE SERVICIOS GENERALES"]
["AL 26 DE OCTUBRE DE 2005"]
[]
["NOMBRE","PAGO POR TRABAJOS LOS DIAS SABADOS",null,null,"TRABAJOS EXTRAORDINARIOS",null,"GRAN TOTAL"]
[null,"SDO DIARIO","DIAS LABORADOS","IMPORTE","DIAS LABORADOS","IMPORTE"]
["MARCO ANTONIO CAAMAL CAN",119.54,3,{"$f":"B7*C7","v":358.62},4,{"$f":"E7*B7","v":478.16},{"$f":"F7+D7","v":836.78}]
["HERMENEGILDO MEX COLLI",119.54,1,119.54,null,null,119.54]
["VICTOR AUGUSTO MAAS CAAMAL",119.54,2,239.08,4,{"$f":"E9*B9","v":478.16},717.24]
["JULIANA DEL CARMEN HUCHIN UC",119.54,2,239.08,3,{"$f":"E10*B10","v":358.62},597.70000000000005]
["MARTHA MINELDA PECH KOH",119.54,3,358.62,2,{"$f":"E11*B11","v":239.08},597.70000000000005]
["HECTOR MANUEL COUOH MAAS",125.06,2,250.12,4,{"$f":"E12*B12","v":500.24},750.36]
[null,null,null,null,null,null,{"$f":"SUM(G7:G12)","v":3619.32}]